{"text_format":"1","workbook":"xlsx","n_sheets":8,"sheets":["Innehåll","Vägledning","Anvisningar","Data","Diagram 1","Diagram 2","Diagram 3","Diagram 4"],"not_rendered":{"charts":4,"images":16,"macros":1,"external_links":2,"defined_names":68,"comments":1,"pivot_tables":0},"unopened":[],"bounds":{"document_bytes":16777216,"sheet_cells":100000,"rows_first":2000,"rows_last":500,"rows_between":2000,"halvings":0,"cell_chars":16384,"cell_head_chars":4096},"cells_cut":0,"cells_raw":0,"read":"whole","date_system":"1900"}

{"sheet":"Innehåll","index":0,"n_rows":16,"n_cols":3,"rows_kept":16,"cut":false,"hidden":false,"merged":[]}
[]
[null,"Innehållsförteckning"]
[]
[null,"Anvisningar","Anvisningar för att producera diagram till webben"]
[]
[null,"Vägledning","Definitioner och förklaringar"]
[]
[null,"Data","Tidsserier som ligger till grund för diagrammen samt originalserie"]
[]
[null,"Diagram 1","Konfidensindikator. Tillverkningsindustrin"]
[]
[null,"Diagram 2","Konfidensindikator. Byggverksamhet"]
[]
[null,"Diagram 3","Konfidensindikator. Handel"]
[]
[null,"Diagram 4","Konfidensindikator. Tjänstesektorn"]

{"sheet":"Vägledning","index":1,"n_rows":14,"n_cols":3,"rows_kept":14,"cut":false,"hidden":false,"merged":[]}
[]
[null,"Vägledning"]
[]
[null,"Utskriftstips","Utskriftsformatet i samtliga flikar med diagram är förinställt på att utskriften förstoras till 120% och innehållet centreras vertikalt och horisontellt."]
[null,null,"Om utskriften av diagrammen inte blir tillfredställande så ändra inställningarna under utskriftsformat till vad som passar just din skrivare."]
[null,null,"Du kan också i diagrammet, om det är nödvändigt, ändra t.ex färg på en kurva, formateringen av stödlinjer etc."]
[]
[]
[null,"Definitioner & förklaringar","Konfidensindikatorn beräknas som ett medelvärde av nettotalen (säsongsrensade och standardiserade) för utvalda frågor. Denna tidsserie standardiseras sedan till en ny serie med medelvärde 100 och standardavvikelse 10 från 1996 och framåt. Ytterligare resultat och information om konjunkturbarometern finns hos Konjunkturinstitutet."]
[null,null,"Med tillverkningsindustrin avses SNI 10-33. Konfidensindikatorer för tillverkningsindustrin beräknas enligt formeln konfidensindikator = orderstock (nulägesomdöme) - färdigvarulager (nulägesomdöme) + produktionsvolym (förväntningar)."]
[]
[null,null,"Med byggverksamhet avses SNI 41-43. Konfidensindikatorer för byggverksamhet beräknas enligt formeln konfidensindikator = orderstock (nulägesomdöme) + antalet anställda (förväntningar).\n"]
[null,null,"Med handel avses SNI 45-47. Konfidensindikatorer för handeln beräknas enligt formeln konfidensindikator = försäljningsvolym (utfall) – varulager (nulägesomdöme) + försäljningsvolym (förväntningar)."]
[null,null,"Med tjänstesektorn avses SNI 49-82, 95-96. Konfidensindikatorer för tjänstesektorn beräknas enligt formeln konfidensindikator = utvecklingen av företagets verksamhet (utfall) + efterfrågan på företagets tjänster (utfall) + efterfrågan på företagets tjänster (förväntningar). För tjänstesektorn är konfidensindikatorn för perioden 1996-2002 skattad utifrån kvartalsserier för ett begränsat antal tjänstebranscher.\n"]

{"sheet":"Anvisningar","index":2,"n_rows":70,"n_cols":18,"rows_kept":70,"cut":false,"hidden":false,"merged":[[57,10,57,14],[44,8,44,11]]}
[]
[]
[]
[]
[null,null,null,null,null,null,null,"Diagramuppgifter",null,{"$f":"IF(OR(yy=\"\",mm=\"\"),\"\",\"Data t.o.m \" & LOOKUP(mm,id,mmSv) & \" \" & yy)","v":"Data t.o.m maj 2026"}]
[null,null,null,null,null,null,null,null,null,{"$f":"IF(OR(yy=\"\",mm=\"\"),\"\",\"Data up to and including \" & LOOKUP(N(mm),id,mmEng) & \" \" & yy)","v":"Data up to and including May 2026"}]
[]
[null,null,null,null,null,null,null,"pong  (YYYYXnn)"]
[]
[null,null,null,null,null,null,null,"produktkod"]
[]
[null,null,null,null,null,null,null,"aktuell period för data:  år",null,2026]
[null,null,null,null,null,null,null,null,"månad nr",5,null,null,null,null,null,null,null,"Till PS:are"]
[null,null,null,null,null,null,null,null,null,null,null,null,null,null,null,null,null,"Excelexporten fungerar inte. Gör en \"manuell\" källdatafil genom att ta bort fliken \"Anvisningar\" och lägg in i EPi. /Magnus"]
[null,null,null,null,null,null,null,"skapa alltid Excelfil",null,null,"beskrivning *)",null,null,"filnamn i klartext"]
[null,null,null,null,null,null,null,null,null,null,null,null,null,"sv",{"$f":"IF(I55=FALSE,\"\",IF(TRIM(I51)=\"\",\"\",I51&\"DI_01_SV\"&IF(TRIM(I53)<>\"\",\"_\"&TRIM(I53),\"\")))","v":""}]
[null,null,null,null,null,null,null,null,null,null,null,null,null,"eng",{"$f":"IF(I55=FALSE,\"\",IF(TRIM(I51)=\"\",\"\",I51&\"DI_01_EN\"&IF(TRIM(I53)<>\"\",\"_\"&TRIM(I53),\"\")))","v":""}]
[]
[null,null,null,null,null,null,null,"ange diagram-nummer och beskrivning för diagram på följande flikar:"]
[]
[null,null,null,null,null,null,null,"flik-namn",null,"nr (nn)","beskrivning (15 tkn) *)",null,null,"diagram-namn i klartext"]
[]
[null,null,null,null,null,null,null,"Diagram 1/ Graph 1",null,null,null,null,null,"sv",{"$f":"IF(TRIM(L47)=\"\",\"\",\"DI_\"&IF(LEN(TRIM(L47))<2,\"0\"&TRIM(L47),TRIM(L47))&\"_SV\" & IF(TRIM(L48)<>\"\",\"_\"&TRIM(L48),\"\"))","v":"DI_25_SV_konjbarom_tillv"}]
[null,null,null,null,null,null,null,null,null,null,null,null,null,"eng",{"$f":"IF(TRIM(L47)=\"\",\"\",\"DI_\"&IF(LEN(TRIM(L47))<2,\"0\"&TRIM(L47),TRIM(L47))&\"_EN\" & IF(TRIM(L48)<>\"\",\"_\"&TRIM(L48),\"\"))","v":"DI_25_EN_konjbarom_tillv"}]
[]
[null,null,null,null,null,null,null,"Diagram 2 / Graph 2",null,null,null,null,null,"sv",{"$f":"IF(TRIM(L49)=\"\",\"\",\"DI_\"&IF(LEN(TRIM(L49))<2,\"0\"&TRIM(L49),TRIM(L49))&\"_SV\" & IF(TRIM(L50)<>\"\",\"_\"&TRIM(L50),\"\"))","v":"DI_26_SV_konjbarom_bygg"}]
[null,null,null,null,null,null,null,null,null,null,null,null,null,"eng",{"$f":"IF(TRIM(L49)=\"\",\"\",\"DI_\"&IF(LEN(TRIM(L49))<2,\"0\"&TRIM(L49),TRIM(L49))&\"_EN\" & IF(TRIM(L50)<>\"\",\"_\"&TRIM(L50),\"\"))","v":"DI_26_EN_konjbarom_bygg"}]
[]
[null,null,null,null,null,null,null,"Diagram 3 / Graph 3",null,null,null,null,null,"sv",{"$f":"IF(TRIM(L51)=\"\",\"\",\"DI_\"&IF(LEN(TRIM(L51))<2,\"0\"&TRIM(L51),TRIM(L51))&\"_SV\" & IF(TRIM(L52)<>\"\",\"_\"&TRIM(L52),\"\"))","v":"DI_27_SV_konjbarom_hande"}]
[null,null,null,null,null,null,null,null,null,null,null,null,null,"eng",{"$f":"IF(TRIM(L51)=\"\",\"\",\"DI_\"&IF(LEN(TRIM(L51))<2,\"0\"&TRIM(L51),TRIM(L51))&\"_EN\" & IF(TRIM(L52)<>\"\",\"_\"&TRIM(L52),\"\"))","v":"DI_27_EN_konjbarom_hande"}]
[]
[null,null,null,null,null,null,null,"Diagram 4 / Graph 4",null,null,null,null,null,"sv",{"$f":"IF(TRIM(L53)=\"\",\"\",\"DI_\"&IF(LEN(TRIM(L53))<2,\"0\"&TRIM(L53),TRIM(L53))&\"_SV\" & IF(TRIM(L54)<>\"\",\"_\"&TRIM(L54),\"\"))","v":"DI_28_SV_konjbarom_tjans"}]
[null,null,null,null,null,null,null,null,null,null,null,null,null,"eng",{"$f":"IF(TRIM(L53)=\"\",\"\",\"DI_\"&IF(LEN(TRIM(L53))<2,\"0\"&TRIM(L53),TRIM(L53))&\"_EN\" & IF(TRIM(L54)<>\"\",\"_\"&TRIM(L54),\"\"))","v":"DI_28_EN_konjbarom_tjans"}]
[]
[null,null,null,null,null,null,null,"Diagram 5 / Graph 5",null,null,null,null,null,"sv",{"$f":"IF(TRIM(L55)=\"\",\"\",\"DI_\"&IF(LEN(TRIM(L55))<2,\"0\"&TRIM(L55),TRIM(L55))&\"_SV\" & IF(TRIM(L56)<>\"\",\"_\"&TRIM(L56),\"\"))","v":""}]
[null,null,null,null,null,null,null,null,null,null,null,null,null,"eng",{"$f":"IF(TRIM(L55)=\"\",\"\",\"DI_\"&IF(LEN(TRIM(L55))<2,\"0\"&TRIM(L55),TRIM(L55))&\"_EN\" & IF(TRIM(L56)<>\"\",\"_\"&TRIM(L56),\"\"))","v":""}]
[]
[null,null,null,null,null,null,null,"filerna sparas här:",null,"\\\\wp\\xmlDump"]
[]
[null,null,null,null,null,null,null,"*) frivillig uppgift"]
[]
[]
[]
[]
[null,null,null,null,null,null,null,null,"Mellanlagring av värden"]
[null,null,null,null,null,null,null,null,"pong",null,"diagramidentitet"]
[null,null,null,null,null,null,null,null,"2026M05",null,"nr:","25"]
[null,null,null,null,null,null,null,null,"produktkod",null,"beskrivning:","konjbarom_tillv"]
[null,null,null,null,null,null,null,null,"OV0011",null,"nr:","26"]
[null,null,null,null,null,null,null,null,"Pong+prodkod",null,"beskrivning:","konjbarom_bygg"]
[null,null,null,null,null,null,null,null,{"$f":"IF(OR(TRIM(I47)=\"\",TRIM(I49)=\"\"),\"\",I49&\"_\"&I47&\"_\")","v":"OV0011_2026M05_"},null,"nr:","27"]
[null,null,null,null,null,null,null,null,"Beskrivn Excelfil",null,"beskrivning:","konjbarom_hande"]
[null,null,null,null,null,null,null,null,"konjbarometer",null,"nr:","28"]
[null,null,null,null,null,null,null,null,"Skapa Excelfil",null,"beskrivning:","konjbarom_tjans"]
[null,null,null,null,null,null,null,null,false,null,"nr:",""]
[null,null,null,null,null,null,null,null,null,null,"beskrivning:",""]
[]
[null,null,null,null,null,null,null,null,null,null,"Hjälplista"]
[null,null,null,null,null,null,null,null,null,null,1,"januari","January","första","First"]
[null,null,null,null,null,null,null,null,null,null,2,"februari","February","andra","Second"]
[null,null,null,null,null,null,null,null,null,null,3,"mars","March","tredje","Third"]
[null,null,null,null,null,null,null,null,null,null,4,"april","April","fjärde","Fourth"]
[null,null,null,null,null,null,null,null,null,null,5,"maj","May"]
[null,null,null,null,null,null,null,null,null,null,6,"juni","June"]
[null,null,null,null,null,null,null,null,null,null,7,"juli","July"]
[null,null,null,null,null,null,null,null,null,null,8,"augusti","August"]
[null,null,null,null,null,null,null,null,null,null,9,"september","September"]
[null,null,null,null,null,null,null,null,null,null,10,"oktober","October"]
[null,null,null,null,null,null,null,null,null,null,11,"november","November"]
[null,null,null,null,null,null,null,null,null,null,12,"december","December"]

{"sheet":"Data","index":3,"n_rows":378,"n_cols":7,"rows_kept":378,"cut":false,"hidden":false,"merged":[]}
["Economic Tendency Survey",null,null,null,null,null,{"$f":"[0]!timePeriodEng","v":"Data up to and including May 2026"}]
[]
["Year",null,"Month","Confidence indicator Manufacturing","Construction","Trade","Service sector"]
["Konjunkturbarometer",null,null,null,null,null,{"$f":"[0]!timeperiodSv","v":"Data t.o.m maj 2026"}]
[]
["År",null,"Månad","Konfidensindikator Tillverkningsindustri","Byggverksamhet","Handel","Tjänstesektorn"]
[1996,null,1,null,null,null,94.8]
[1996,null,2,89.7,90.9,null,95.2]
[1996,null,3,85,89,null,93]
[1996,null,4,87.9,89.4,null,90.4]
[1996,null,5,84.8,88.7,null,90.8]
[1996,null,6,81,87.9,null,92.8]
[1996,1996,7,86.6,85.1,82.1,94.2]
[1996,null,8,86,86.9,89,95.8]
[1996,null,9,87.4,83.8,88.2,97.1]
[1996,null,10,92.3,82.1,86.6,99.4]
[1996,null,11,92.7,81,88,99.9]
[1996,null,12,90.4,82,90.2,100.4]
[1997,null,1,96.3,80.2,91.4,99.6]
[1997,null,2,94.8,80.5,89.9,100.7]
[1997,null,3,98.9,79.900000000000006,92.2,100.4]
[1997,null,4,98.8,78.3,89.9,100.9]
[1997,null,5,95.1,78.099999999999994,94.4,100.8]
[1997,null,6,96.8,77.599999999999994,95,101.6]
[1997,1997,7,100.5,78.2,99.8,101.5]
[1997,null,8,101.3,76.599999999999994,94.4,102.9]
[1997,null,9,104.5,78.400000000000006,93.9,104.9]
[1997,null,10,104.7,80.2,94.4,107.6]
[1997,null,11,103.5,81.2,99.6,107.9]
[1997,null,12,105,82.2,98.3,107.6]
[1998,null,1,108.8,82,95.9,106.9]
[1998,null,2,104.7,82.7,96.5,107.2]
[1998,null,3,105.1,82.4,98.5,107]
[1998,null,4,99.8,85.7,97.2,107.3]
[1998,null,5,104.7,84.6,95.2,106.5]
[1998,null,6,107,90,96.9,105.9]
[1998,1998,7,105.2,91.9,95.5,105.2]
[1998,null,8,98.8,92.7,94.5,104.1]
[1998,null,9,98.6,94.8,95.1,103.1]
[1998,null,10,96.8,95.6,98,101.8]
[1998,null,11,94.9,96.1,95.6,100.5]
[1998,null,12,92.9,96.5,94.4,99.8]
[1999,null,1,89.1,95.4,96.3,97.6]
[1999,null,2,88.9,94.7,98.6,98.9]
[1999,null,3,87.1,93.4,96,100.8]
[1999,null,4,87.3,94.8,96.7,103.9]
[1999,null,5,96.7,94.3,100.1,105]
[1999,null,6,98,92.7,100.6,106.1]
[1999,1999,7,97.3,91,101,106.9]
[1999,null,8,102.1,92.1,104.4,107.3]
[1999,null,9,103.3,92.1,108.1,108.1]
[1999,null,10,101.4,92.5,107.1,106.9]
[1999,null,11,104.7,93.3,108.3,108.5]
[1999,null,12,106,93.6,109.5,109.5]
[2000,null,1,105.8,92.3,109.7,112]
[2000,null,2,107.3,99.6,111.6,111.8]
[2000,null,3,110.6,100,112.8,112.2]
[2000,null,4,109.5,99.8,113.2,113]
[2000,null,5,107.4,101.1,113.7,113]
[2000,null,6,107.7,103.3,112.7,113.1]
[2000,2000,7,108.7,104.7,112.8,114.2]
[2000,null,8,107.4,106.1,111.1,111.8]
[2000,null,9,105.2,106.7,108.8,109.6]
[2000,null,10,107.8,108.6,109.4,105.6]
[2000,null,11,107.7,107.3,104.4,103.4]
[2000,null,12,102,109.2,99.6,99.8]
[2001,null,1,97.5,111,101.6,97.9]
[2001,null,2,93.9,106.7,98.2,95.9]
[2001,null,3,90.3,106.5,97.1,95.6]
[2001,null,4,87.4,105.1,94.1,97.2]
[2001,null,5,85.9,103,91.1,93]
[2001,null,6,84.5,105.3,89.2,89]
[2001,2001,7,83.8,105.3,89.6,80.2]
[2001,null,8,84.7,103.4,87.7,80.900000000000006]
[2001,null,9,85.5,102.5,86.2,85.6]
[2001,null,10,83.5,100,87,87.5]
[2001,null,11,84.7,96.6,88,91]
[2001,null,12,87.3,96.7,90.2,92.2]
[2002,null,1,86.9,96.6,91.6,96]
[2002,null,2,88,96.1,92.3,92]
[2002,null,3,91.4,97.7,94.6,93.6]
[2002,null,4,91,97.6,99,92.9]
[2002,null,5,91.9,95.2,98.9,87.7]
[2002,null,6,101.2,91.7,99.7,86.8]
[2002,2002,7,93.4,90.4,101.6,89.6]
[2002,null,8,92.5,91.3,100,87.7]
[2002,null,9,95.8,88.6,100,86.7]
[2002,null,10,92.2,88.1,99,81.400000000000006]
[2002,null,11,89.8,90.4,100.5,87]
[2002,null,12,92.8,89.6,99.7,88.8]
[2003,null,1,92.5,89.6,97.5,85.3]
[2003,null,2,100.1,92.5,94.9,90.3]
[2003,null,3,100.4,91.1,92.2,84.5]
[2003,null,4,95.8,88.8,90.3,81.5]
[2003,null,5,95.3,86.8,89.1,86.9]
[2003,null,6,86.6,85.7,86.7,89.2]
[2003,2003,7,84,81.8,84.2,88.7]
[2003,null,8,89.7,83,86.9,89]
[2003,null,9,88.9,84,90.3,89]
[2003,null,10,91.7,83.9,89.9,90.1]
[2003,null,11,91.6,83.2,93.3,90.9]
[2003,null,12,94,83,90.8,97.3]
[2004,null,1,94.7,83.7,89.4,93.7]
[2004,null,2,95,85.4,91.6,96.1]
[2004,null,3,95.6,86.6,92.6,97.3]
[2004,null,4,98.8,91,91.8,99.4]
[2004,null,5,101,91.5,93.5,101.6]
[2004,null,6,100.6,94.6,92.2,103.9]
[2004,2004,7,101.7,98,89.1,104.1]
[2004,null,8,102.1,98.1,91.5,109.2]
[2004,null,9,105.8,99.7,90.7,111.3]
[2004,null,10,100.4,101.2,88.9,108.5]
[2004,null,11,102.9,104.1,88.6,105.2]
[2004,null,12,100.1,106.7,91.6,102.3]
[2005,null,1,101.1,105.9,90.5,108.2]
[2005,null,2,98.6,104,91.7,108.3]
[2005,null,3,94.3,104,90,111]
[2005,null,4,90.1,105.1,88.8,108.6]
[2005,null,5,93.2,105.3,89.8,103.8]
[2005,null,6,93.4,107,93.5,108.4]
[2005,2005,7,89.9,110.3,94,107.9]
[2005,null,8,96.1,105.5,97,101.8]
[2005,null,9,93.5,109.7,98.5,109.6]
[2005,null,10,97.3,108.1,99.5,109.5]
[2005,null,11,93.7,108.8,102.7,114.6]
[2005,null,12,99.5,109.9,104.9,109.9]
[2006,null,1,102.4,112.9,109.4,110.4]
[2006,null,2,101.6,112.8,111.5,115.2]
[2006,null,3,101.1,111.1,110.4,111.2]
[2006,null,4,100.5,113.3,111.2,112.3]
[2006,null,5,98.9,112.3,112.3,111.6]
[2006,null,6,105.5,110.4,112.6,107.5]
[2006,2006,7,102.1,109.6,116.4,105.3]
[2006,null,8,101.6,110.1,108.5,110.7]
[2006,null,9,103,109,112.8,110.1]
[2006,null,10,104,112.5,114.3,112.4]
[2006,null,11,107.6,112.7,113,114]
[2006,null,12,102.8,113.6,113.3,115.2]
[2007,null,1,102.9,114.1,110.9,116.5]
[2007,null,2,104.9,116.7,111.2,113.7]
[2007,null,3,104.8,116.6,113.5,112.8]
[2007,null,4,111.2,120.6,115.2,111]
[2007,null,5,106,119.8,112.6,114.7]
[2007,null,6,107.9,120.5,110.7,113.5]
[2007,2007,7,105.1,120.1,111.1,116.1]
[2007,null,8,101.7,119.8,113,114.5]
[2007,null,9,100.3,118.1,110.3,110.8]
[2007,null,10,101.9,119.6,108.7,110.6]
[2007,null,11,102.6,118.8,110.2,107.7]
[2007,null,12,104.5,117.1,107.3,107.1]
[2008,null,1,101.7,114.9,105.3,103.2]
[2008,null,2,99.4,113.5,103.8,102.4]
[2008,null,3,101,112.4,103.9,105.5]
[2008,null,4,101.3,110.8,103.6,104.6]
[2008,null,5,96.9,108.6,99.4,97.4]
[2008,null,6,90.2,108.8,99.4,102.4]
[2008,2008,7,88.4,112.9,95.3,96.1]
[2008,null,8,86.9,109.1,91,92.4]
[2008,null,9,87.7,109,88.8,93.4]
[2008,null,10,84.3,107.4,86.6,87.1]
[2008,null,11,77.8,101.3,75,76.5]
[2008,null,12,71.2,99.3,74.2,75.900000000000006]
[2009,null,1,73.8,96.8,71.5,76.2]
[2009,null,2,74.7,94.2,74.599999999999994,73.5]
[2009,null,3,66.900000000000006,92.9,74.599999999999994,73.900000000000006]
[2009,null,4,70.900000000000006,88.9,74.8,72.7]
[2009,null,5,75.400000000000006,88.4,80.599999999999994,75.5]
[2009,null,6,76.3,89.1,85.3,77.5]
[2009,null,7,86.9,87.3,82.7,81.099999999999994]
[2009,null,8,87,88.5,93.5,85.9]
[2009,null,9,85,87.6,97.2,90.9]
[2009,null,10,91.8,89.7,100.1,94.4]
[2009,null,11,94.6,90.8,105.4,96.3]
[2009,null,12,99.4,90.8,108.3,104.4]
[2010,null,1,100,92.7,113.5,104]
[2010,null,2,105.7,93.9,110,104.5]
[2010,null,3,102.8,93.2,109.9,104.7]
[2010,null,4,97.7,97.8,111.9,106.1]
[2010,null,5,102.8,103.5,109.1,112.5]
[2010,null,6,107.9,103.2,109.1,110]
[2010,2010,7,102.2,103.7,111.2,114.9]
[2010,null,8,107.5,105,106.9,110.9]
[2010,null,9,113.1,108.5,111,113.1]
[2010,null,10,108.2,107.7,113.2,114.6]
[2010,null,11,109.9,109.2,114.3,119.4]
[2010,null,12,106.5,110.2,113.3,118]
[2011,null,1,112.3,109.1,109.3,116.2]
[2011,null,2,111.2,112.1,107.9,118.2]
[2011,null,3,109.4,111.2,105.7,113.3]
[2011,null,4,104.6,111.6,105,112]
[2011,null,5,110.4,111.6,101.9,109.4]
[2011,null,6,106.9,109.7,99.8,108.1]
[2011,null,7,99.4,106.9,96.9,105.5]
[2011,null,8,97.8,103.8,92.6,101.4]
[2011,null,9,98.4,103.3,88.7,98.6]
[2011,null,10,97.3,104.8,86.8,97.9]
[2011,null,11,92.9,101.8,86.4,100.4]
[2011,null,12,93.2,101.2,85.4,96.9]
[2012,null,1,90,102,87.8,92]
[2012,null,2,92.1,99.2,91.3,92.7]
[2012,null,3,99.9,101.5,96.8,99.7]
[2012,null,4,98.2,104.4,94,103.9]
[2012,null,5,101.9,95.7,93.7,97]
[2012,null,6,97.1,94.7,89.9,96.8]
[2012,2012,7,97,94.6,92,92.2]
[2012,null,8,92.7,95.1,92.8,96.6]
[2012,null,9,95.6,92.8,95.6,95]
[2012,null,10,90,90.8,90.9,92.7]
[2012,null,11,85.2,87.5,90.4,86.5]
[2012,null,12,89.5,86.8,91.3,88]
[2013,null,1,85.6,91.6,91.2,89.2]
[2013,null,2,94.1,90.5,92.8,92.3]
[2013,null,3,91.8,91.1,93.4,97.5]
[2013,null,4,92.3,90.2,88.7,94.3]
[2013,null,5,90.7,92.4,89.4,96.2]
[2013,null,6,93.9,92.4,96.2,98.2]
[2013,null,7,93.7,91.2,96.9,100.8]
[2013,null,8,96.5,90.7,101,99.3]
[2013,null,9,94.5,92.7,98.7,105.7]
[2013,null,10,96.5,91.5,103,102.7]
[2013,null,11,99.6,93.3,106.3,104]
[2013,null,12,98.5,96.2,105.3,104.8]
[2014,null,1,99.9,95.9,106.9,106.9]
[2014,null,2,96.3,96.2,107.2,105.6]
[2014,null,3,96.4,97.4,107.1,105.5]
[2014,null,4,101.3,98.1,109.5,103.6]
[2014,null,5,95,98.6,110.4,103.7]
[2014,null,6,99.1,100.5,110.2,103]
[2014,2014,7,100.2,101.5,111.4,101.3]
[2014,null,8,104.2,102.1,108,101.7]
[2014,null,9,101.3,100.8,110.1,99.2]
[2014,null,10,101.8,100.5,110.5,101.9]
[2014,null,11,101.9,101.7,107.3,100.8]
[2014,null,12,98.7,101.7,106.9,104.7]
[2015,null,1,98.6,101,109.9,104]
[2015,null,2,98.9,99.4,111.3,103.9]
[2015,null,3,97.8,97.7,110.1,103.5]
[2015,null,4,92.8,101.3,112.5,105.8]
[2015,null,5,100.2,102.2,113,105.2]
[2015,null,6,100.6,102.5,110.3,104.3]
[2015,null,7,101.7,105.2,109.4,105]
[2015,null,8,103.2,104.6,113,105.5]
[2015,null,9,107.6,106.4,112.6,105.3]
[2015,null,10,106.3,111.3,112.8,105.2]
[2015,null,11,102.8,111.2,114.8,106.3]
[2015,null,12,105.5,108.8,115.8,104.8]
[2016,null,1,111.7,107.5,115.8,104.5]
[2016,null,2,107.7,108.9,110.7,102.9]
[2016,null,3,106.7,109.7,110.3,102.7]
[2016,null,4,100.8,111.5,111.6,104.3]
[2016,null,5,101.4,109.4,109.3,103]
[2016,null,6,101.7,109.2,106.9,103]
[2016,2016,7,99.8,110.2,109.3,104.9]
[2016,null,8,97.3,109.8,107.5,105.3]
[2016,null,9,100.2,111.8,104.7,106.1]
[2016,null,10,103.1,110.6,105.5,104.6]
[2016,null,11,106.6,112.4,103,105.9]
[2016,null,12,112.9,113,101.9,108.1]
[2017,null,1,111.6,113.1,102.4,106]
[2017,null,2,110.2,114.3,104,106.8]
[2017,null,3,107.5,116.1,104.8,107.1]
[2017,null,4,115.1,114.4,103.9,105.6]
[2017,null,5,113.9,117.8,103.6,106.9]
[2017,null,6,116,115.1,108,105.8]
[2017,null,7,114.2,113.8,109.7,106.5]
[2017,null,8,111.1,115.8,105.3,106.7]
[2017,null,9,119.8,117,104.6,103.7]
[2017,null,10,116.1,117.4,105.7,104.3]
[2017,null,11,116.6,115.6,104.2,104.4]
[2017,null,12,110.4,115.4,102.5,107.3]
[2018,null,1,109.5,115.8,104.9,105.5]
[2018,null,2,109.8,113.8,109.1,106.4]
[2018,null,3,113.2,114,107.4,104.1]
[2018,null,4,115.8,116.4,101.7,104.3]
[2018,null,5,115.9,114.4,105,104]
[2018,null,6,114.5,112.4,105.1,106.4]
[2018,2018,7,115.2,111.1,101.1,105.6]
[2018,null,8,117.6,111.2,103.8,102.3]
[2018,null,9,113.6,108.8,105.7,105.3]
[2018,null,10,112.1,108.1,103.1,101.6]
[2018,null,11,112.2,105.1,103.5,99.1]
[2018,null,12,113.6,108.5,102.4,98.9]
[2019,null,1,107.3,105.8,101.4,96.9]
[2019,null,2,109.6,109.2,99.3,96.8]
[2019,null,3,105.1,106.3,101.1,101.4]
[2019,null,4,107.7,105.9,103.1,101.8]
[2019,null,5,102,105.6,105.2,102.1]
[2019,null,6,101.1,107.7,103.1,101.1]
[2019,null,7,96.6,103.7,100.7,98.9]
[2019,null,8,93.4,106.4,100,97.3]
[2019,null,9,94.7,105.4,98.7,93.3]
[2019,null,10,94.5,109,99.5,91.3]
[2019,null,11,94,105.4,103,94.4]
[2019,null,12,93.9,102.6,103.9,92.7]
[2020,null,1,98.8,106.9,103.9,94.9]
[2020,null,2,101.5,103.1,106.8,94.8]
[2020,null,3,99,102.8,103.8,88.1]
[2020,null,4,71,94.5,73.599999999999994,50.8]
[2020,null,5,75.3,88.2,76.3,53.7]
[2020,null,6,89.4,90,81.7,62.3]
[2020,2020,7,95.9,92.5,94.3,73.400000000000006]
[2020,null,8,97.1,92.7,98.3,79]
[2020,null,9,103.7,92.2,102.5,86.6]
[2020,null,10,103.5,90.9,105.9,87.8]
[2020,null,11,107.3,95.4,97.5,89.7]
[2020,null,12,106,94.1,99.7,88]
[2021,null,1,113.1,92.6,98,93.4]
[2021,null,2,112.4,94.6,100.4,97.2]
[2021,null,3,114.9,96,98.8,96.7]
[2021,null,4,118.4,99.7,111.6,105.7]
[2021,null,5,122.2,103.9,111.4,108.6]
[2021,null,6,121.4,106.4,113.3,111.1]
[2021,null,7,126.3,108.2,119.4,113.5]
[2021,null,8,125.8,107.4,111.8,112.3]
[2021,null,9,124.5,108.1,117.8,112.5]
[2021,null,10,128.19999999999999,110.4,119.4,114.8]
[2021,null,11,125.9,110.4,121.1,114.9]
[2021,null,12,128.1,108.1,116.3,112.6]
[2022,null,1,124.1,111.3,108.5,107.2]
[2022,null,2,125.1,109.3,118.5,107.9]
[2022,null,3,124.3,109.8,113.2,109]
[2022,null,4,121.3,106.6,111.5,108.3]
[2022,null,5,124.2,106.6,109.9,107.3]
[2022,null,6,119,104.7,105.1,103.4]
[2022,2022,7,120.5,104.5,96.4,102]
[2022,null,8,116.1,104.1,94.6,97.6]
[2022,null,9,111,104.9,88.3,96]
[2022,null,10,106.5,103,81.3,91.9]
[2022,null,11,105.6,101.7,79.599999999999994,90]
[2022,null,12,105.4,101.6,79.099999999999994,90.1]
[2023,null,1,102.3,99.8,80,88.5]
[2023,null,2,103.4,97.2,78.2,90.3]
[2023,null,3,103,97,81.8,90.5]
[2023,null,4,99.8,94.8,77.099999999999994,88.1]
[2023,null,5,101.7,98.8,81.599999999999994,88.6]
[2023,null,6,100.5,92.3,82.5,90.3]
[2023,null,7,97.7,89.4,84.7,90.4]
[2023,null,8,97.1,90.9,85,87.3]
[2023,null,9,101.7,91.6,81.599999999999994,87.1]
[2023,null,10,101.5,90.8,87.9,85.8]
[2023,null,11,99.9,90.8,87.7,84.8]
[2023,null,12,93.9,92.4,87.5,86.2]
[2024,null,1,99.8,90.8,90.4,89.8]
[2024,null,2,99.5,92.8,92.7,89.4]
[2024,null,3,98.4,90.6,94.5,92.9]
[2024,null,4,99.1,93.8,99.8,93]
[2024,null,5,97.8,92.3,92.5,93.9]
[2024,null,6,98,94.1,98.4,97.4]
[2024,2024,7,97.2,95,101.3,94.1]
[2024,null,8,97.3,93.8,99.4,92.9]
[2024,null,9,94.3,91.5,103.6,95.7]
[2024,null,10,92.7,92.3,101.2,94.9]
[2024,null,11,96.4,92.2,102.9,97.4]
[2024,null,12,95.6,90.1,105.7,98.2]
[2025,null,1,94.4,95.5,105.2,98.2]
[2025,null,2,96.3,92.6,108.1,99.2]
[2025,null,3,96.9,94.1,103.4,97.7]
[2025,null,4,99,97.1,103.5,97.5]
[2025,null,5,100.5,100.6,104.1,96.1]
[2025,null,6,98.6,98,96.8,93.9]
[2025,null,7,95.8,96.9,101,97.8]
[2025,null,8,97.9,98,104,99.3]
[2025,null,9,99.3,97.5,104.5,99.4]
[2025,null,10,100.7,98.3,111.7,102.6]
[2025,null,11,100.8,102.8,108.2,104.1]
[2025,null,12,103.4,100.1,109.6,105.7]
[2026,null,1,103.3,97.6,109.5,104.9]
[2026,null,2,97.3,100.9,108.4,103.3]
[2026,null,3,100.7,103.2,102,101.2]
[2026,null,4,100,100.3,108.3,101.9]
[2026,null,5,100.5,99.6,109.1,101.3]
[2026,null,6]
[2026,2026,7]
[2026,null,8]
[2026,null,9]
[2026,null,10]
[2026,null,11]
[2026,null,12]

{"sheet":"Diagram 1","index":4,"n_rows":2,"n_cols":2,"rows_kept":2,"cut":false,"hidden":false,"merged":[]}
[null,"Konjunkturbarometer tillverkningsindustrin"]
[null,"Konfidensindikator. Index medelvärde=100. Säsongrensade värden"]

{"sheet":"Diagram 2","index":5,"n_rows":2,"n_cols":2,"rows_kept":2,"cut":false,"hidden":false,"merged":[]}
[null,"Konjunkturbarometer byggverksamhet"]
[null,"Konfidensindikator. Index medelvärde=100. Säsongrensade värden"]

{"sheet":"Diagram 3","index":6,"n_rows":2,"n_cols":2,"rows_kept":2,"cut":false,"hidden":false,"merged":[]}
[null,"Konjunkturbarometer handel"]
[null,"Konfidensindikator. Index medelvärde=100. Säsongrensade värden"]

{"sheet":"Diagram 4","index":7,"n_rows":2,"n_cols":2,"rows_kept":2,"cut":false,"hidden":false,"merged":[]}
[null,"Konjunkturbarometer tjänstesektorn"]
[null,"Konfidensindikator. Index medelvärde=100. Säsongrensade värden"]