{"text_format":"1","workbook":"xlsx","n_sheets":8,"sheets":["RepairFormula","Db","Start","Frontpaper","Instructions","Immidiate_borrower_basis","Country_Information","Summary"],"not_rendered":{"charts":0,"images":0,"macros":1,"external_links":0,"defined_names":2,"comments":1,"pivot_tables":0},"unopened":[],"bounds":{"document_bytes":16777216,"sheet_cells":100000,"rows_first":2000,"rows_last":500,"rows_between":2000,"halvings":0,"cell_chars":16384,"cell_head_chars":4096},"cells_cut":0,"cells_raw":0,"read":"whole","date_system":"1900"}

{"sheet":"RepairFormula","index":0,"n_rows":60,"n_cols":3,"rows_kept":60,"cut":false,"hidden":true,"merged":[]}
["Immidiate_borrower_basis","$T$16",{"$f":"IF(ABS(F16-(SUM(G16:J16)))<=2,\"OK\",\"Error\")","v":"OK"}]
["Immidiate_borrower_basis","$U$16",{"$f":"IF(ABS(F16-(SUM(K16:P16)))<=2,\"OK\",\"Error\")","v":"OK"}]
["Immidiate_borrower_basis","$T$17",{"$f":"IF(ABS(F17-(SUM(G17:J17)))<=2,\"OK\",\"Error\")","v":"OK"}]
["Immidiate_borrower_basis","$U$17",{"$f":"IF(ABS(F17-(SUM(K17:P17)))<=2,\"OK\",\"Error\")","v":"OK"}]
["Immidiate_borrower_basis","$T$18",{"$f":"IF(ABS(F18-(SUM(G18:J18)))<=2,\"OK\",\"Error\")","v":"OK"}]
["Immidiate_borrower_basis","$U$18",{"$f":"IF(ABS(F18-(SUM(K18:P18)))<=2,\"OK\",\"Error\")","v":"OK"}]
["Immidiate_borrower_basis","$T$19",{"$f":"IF(ABS(F19-(SUM(G19:J19)))<=2,\"OK\",\"Error\")","v":"OK"}]
["Immidiate_borrower_basis","$U$19",{"$f":"IF(ABS(F19-(SUM(K19:P19)))<=2,\"OK\",\"Error\")","v":"OK"}]
["Immidiate_borrower_basis","$T$20",{"$f":"IF(ABS(F20-(SUM(G20:J20)))<=2,\"OK\",\"Error\")","v":"OK"}]
["Immidiate_borrower_basis","$U$20",{"$f":"IF(ABS(F20-(SUM(K20:P20)))<=2,\"OK\",\"Error\")","v":"OK"}]
["Immidiate_borrower_basis","$T$21",{"$f":"IF(ABS(F21-(SUM(G21:J21)))<=2,\"OK\",\"Error\")","v":"OK"}]
["Immidiate_borrower_basis","$U$21",{"$f":"IF(ABS(F21-(SUM(K21:P21)))<=2,\"OK\",\"Error\")","v":"OK"}]
["Immidiate_borrower_basis","$T$22",{"$f":"IF(ABS(F22-(SUM(G22:J22)))<=2,\"OK\",\"Error\")","v":"OK"}]
["Immidiate_borrower_basis","$U$22",{"$f":"IF(ABS(F22-(SUM(K22:P22)))<=2,\"OK\",\"Error\")","v":"OK"}]
["Immidiate_borrower_basis","$T$23",{"$f":"IF(ABS(F23-(SUM(G23:J23)))<=2,\"OK\",\"Error\")","v":"OK"}]
["Immidiate_borrower_basis","$U$23",{"$f":"IF(ABS(F23-(SUM(K23:P23)))<=2,\"OK\",\"Error\")","v":"OK"}]
["Immidiate_borrower_basis","$T$24",{"$f":"IF(ABS(F24-(SUM(G24:J24)))<=2,\"OK\",\"Error\")","v":"OK"}]
["Immidiate_borrower_basis","$U$24",{"$f":"IF(ABS(F24-(SUM(K24:P24)))<=2,\"OK\",\"Error\")","v":"OK"}]
["Immidiate_borrower_basis","$T$25",{"$f":"IF(ABS(F25-(SUM(G25:J25)))<=2,\"OK\",\"Error\")","v":"OK"}]
["Immidiate_borrower_basis","$U$25",{"$f":"IF(ABS(F25-(SUM(K25:P25)))<=2,\"OK\",\"Error\")","v":"OK"}]
["Immidiate_borrower_basis","$T$26",{"$f":"IF(ABS(F26-(SUM(G26:J26)))<=2,\"OK\",\"Error\")","v":"OK"}]
["Immidiate_borrower_basis","$U$26",{"$f":"IF(ABS(F26-(SUM(K26:P26)))<=2,\"OK\",\"Error\")","v":"OK"}]
["Immidiate_borrower_basis","$T$27",{"$f":"IF(ABS(F27-(SUM(G27:J27)))<=2,\"OK\",\"Error\")","v":"OK"}]
["Immidiate_borrower_basis","$U$27",{"$f":"IF(ABS(F27-(SUM(K27:P27)))<=2,\"OK\",\"Error\")","v":"OK"}]
["Immidiate_borrower_basis","$T$28",{"$f":"IF(ABS(F28-(SUM(G28:J28)))<=2,\"OK\",\"Error\")","v":"OK"}]
["Immidiate_borrower_basis","$U$28",{"$f":"IF(ABS(F28-(SUM(K28:P28)))<=2,\"OK\",\"Error\")","v":"OK"}]
["Immidiate_borrower_basis","$T$29",{"$f":"IF(ABS(F29-(SUM(G29:J29)))<=2,\"OK\",\"Error\")","v":"OK"}]
["Immidiate_borrower_basis","$U$29",{"$f":"IF(ABS(F29-(SUM(K29:P29)))<=2,\"OK\",\"Error\")","v":"OK"}]
["Immidiate_borrower_basis","$T$30",{"$f":"IF(ABS(F30-(SUM(G30:J30)))<=2,\"OK\",\"Error\")","v":"OK"}]
["Immidiate_borrower_basis","$U$30",{"$f":"IF(ABS(F30-(SUM(K30:P30)))<=2,\"OK\",\"Error\")","v":"OK"}]
{"$rows_left_out":31}
{"sheet":"Db","index":1,"n_rows":331,"n_cols":6,"rows_kept":331,"cut":false,"hidden":true,"merged":[]}
["Start","$G$19",{"$f":"IF(ISBLANK(INDIRECT(CONCATENATE(\"'\",A1,\"'\",\"!\",B1))),\"\",(INDIRECT(CONCATENATE(\"'\",A1,\"'\",\"!\",B1))))","v":""},"7_X_X_X_X_X_X_X_X_X_T3","Start","$G$19"]
["Immidiate_borrower_basis","$F$16",0,"5_A_EF_X_X_X_AU_N_V_B_A","Immidiate_borrower_basis","$F$16"]
["Immidiate_borrower_basis","$G$16","","5_A_EF_LR_X_X_AU_N_V_B_A","Immidiate_borrower_basis","$G$16"]
["Immidiate_borrower_basis","$H$16","","5_A_EF_LS_X_X_AU_N_V_B_A","Immidiate_borrower_basis","$H$16"]
["Immidiate_borrower_basis","$I$16","","5_A_EF_LY_X_X_AU_N_V_B_A","Immidiate_borrower_basis","$I$16"]
["Immidiate_borrower_basis","$J$16","","5_A_EF_LZ_X_X_AU_N_V_B_A","Immidiate_borrower_basis","$J$16"]
["Immidiate_borrower_basis","$K$16","","5_A_EF_X_X_X_AU_N12111_V_B_A","Immidiate_borrower_basis","$K$16"]
["Immidiate_borrower_basis","$L$16","","5_A_EF_X_X_X_AU_NXU_V_B_A","Immidiate_borrower_basis","$L$16"]
["Immidiate_borrower_basis","$M$16","","5_A_EF_X_X_X_AU_N122_V_B_A","Immidiate_borrower_basis","$M$16"]
["Immidiate_borrower_basis","$N$16","","5_A_EF_X_X_X_AU_N11_V_B_A","Immidiate_borrower_basis","$N$16"]
["Immidiate_borrower_basis","$O$16","","5_A_EF_X_X_X_AU_N3_V_B_A","Immidiate_borrower_basis","$O$16"]
["Immidiate_borrower_basis","$P$16","","5_A_EF_X_X_X_AU_N9_V_B_A","Immidiate_borrower_basis","$P$16"]
["Immidiate_borrower_basis","$F$17",0,"5_A_EF_X_X_X_AT_N_V_B_A","Immidiate_borrower_basis","$F$17"]
["Immidiate_borrower_basis","$G$17","","5_A_EF_LR_X_X_AT_N_V_B_A","Immidiate_borrower_basis","$G$17"]
["Immidiate_borrower_basis","$H$17","","5_A_EF_LS_X_X_AT_N_V_B_A","Immidiate_borrower_basis","$H$17"]
["Immidiate_borrower_basis","$I$17","","5_A_EF_LY_X_X_AT_N_V_B_A","Immidiate_borrower_basis","$I$17"]
["Immidiate_borrower_basis","$J$17","","5_A_EF_LZ_X_X_AT_N_V_B_A","Immidiate_borrower_basis","$J$17"]
["Immidiate_borrower_basis","$K$17","","5_A_EF_X_X_X_AT_N12111_V_B_A","Immidiate_borrower_basis","$K$17"]
["Immidiate_borrower_basis","$L$17","","5_A_EF_X_X_X_AT_NXU_V_B_A","Immidiate_borrower_basis","$L$17"]
["Immidiate_borrower_basis","$M$17","","5_A_EF_X_X_X_AT_N122_V_B_A","Immidiate_borrower_basis","$M$17"]
["Immidiate_borrower_basis","$N$17","","5_A_EF_X_X_X_AT_N11_V_B_A","Immidiate_borrower_basis","$N$17"]
["Immidiate_borrower_basis","$O$17","","5_A_EF_X_X_X_AT_N3_V_B_A","Immidiate_borrower_basis","$O$17"]
["Immidiate_borrower_basis","$P$17","","5_A_EF_X_X_X_AT_N9_V_B_A","Immidiate_borrower_basis","$P$17"]
["Immidiate_borrower_basis","$F$18",0,"5_A_EF_X_X_X_BE_N_V_B_A","Immidiate_borrower_basis","$F$18"]
["Immidiate_borrower_basis","$G$18","","5_A_EF_LR_X_X_BE_N_V_B_A","Immidiate_borrower_basis","$G$18"]
["Immidiate_borrower_basis","$H$18","","5_A_EF_LS_X_X_BE_N_V_B_A","Immidiate_borrower_basis","$H$18"]
["Immidiate_borrower_basis","$I$18","","5_A_EF_LY_X_X_BE_N_V_B_A","Immidiate_borrower_basis","$I$18"]
["Immidiate_borrower_basis","$J$18","","5_A_EF_LZ_X_X_BE_N_V_B_A","Immidiate_borrower_basis","$J$18"]
["Immidiate_borrower_basis","$K$18","","5_A_EF_X_X_X_BE_N12111_V_B_A","Immidiate_borrower_basis","$K$18"]
["Immidiate_borrower_basis","$L$18","","5_A_EF_X_X_X_BE_NXU_V_B_A","Immidiate_borrower_basis","$L$18"]
{"$rows_left_out":302}
{"sheet":"Start","index":2,"n_rows":21,"n_cols":8,"rows_kept":21,"cut":false,"hidden":false,"merged":[[15,4,16,4],[2,6,2,8],[5,6,5,8],[6,6,6,8],[7,6,7,7],[8,6,8,8],[9,6,9,8]]}
[]
[]
[null,null,"Blankettmall version 1.01",null,null,null,"BLANKETT : RUTS konsoliderad BIS hemland"]
[null,null,null,null,null,null,"Version 7, 2013-12-31 ->"]
[]
[null,null,null,null,"(Load text file to template)",null,"Blanketten ska vara Statistiska centralbyrån tillhanda senast den sista bankdagen i månaden efter kvartalsskifte."]
[null,null,null,null,null,null,"The template is to be provided to Statistics Sweden (SCB) at the latest by the last banking day of the month after the end of the quarter."]
[null,null,null,null,"(Create text file from template)"]
[null,null,null,null,null,null,"Blanketten lämnas in via adressen www.insamling.scb.se där ni loggar in med ert användarnamn och lösenord."]
[null,null,null,null,null,null,"The template is submitted via Statistics Sweden web portal at the address www.insamling.scb.se where you log in with your username and password."]
[null,null,null,null,"(Aggregrate templates)"]
[]
[null,null,null,null,null,null,"Summeringskontroller (Consistency checks)","Antal fel (Errors)"]
[null,null,null,null,"(Load XML-file to template)",null,"Immidiate borrower basis",{"$f":"SUM(Immidiate_borrower_basis!T49:U49)","v":0}]
[]
[null,null,null,null,"(Create XML-file from template)"]
[]
[null,null,null,null,null,null,"Kommentar (Comments)"]
[null,null,null,null,"(Repair consistency checks)"]
[]
[null,"7.1"]

{"sheet":"Frontpaper","index":3,"n_rows":24,"n_cols":7,"rows_kept":24,"cut":false,"hidden":false,"merged":[[7,5,7,6],[9,1,9,3],[11,1,11,3],[19,1,19,3],[3,1,3,3],[4,1,4,3],[5,1,5,3],[7,1,7,2]]}
[null,"FM5001"]
[]
[null,"Institutets namn och adress",null,null,null,"BIS-STATISTIK - KONSOLIDERAD"]
[]
[]
[null,null,null,null,null,"Kvartal och år"]
[null,"Organisationsnummer",null,"Institutnummer"]
[]
[null,"Handläggarens namn (Texta)"]
[null,null,null,null,null,"Rapporten ska ha kommit till Statistiska centralbyrån "]
[null,"Telefonnummer (även riktnr)",null,null,null,"senast den sista bankdagen i månaden efter"]
[null,null,null,null,null,"respektive kvartals slut"]
[]
[null,null,null,null,null,"*","Om rapportering ej kan ske elektroniskt, ska"]
[null,"Uppgifterna samlas in med stöd av 6 kap. 9 § lagen",null,null,null,null,"blanketten sändas i ett exemplar till"]
[null,"(1988:1385) om Sveriges riksbank"]
[null,null,null,null,null,null,"Statistiska centralbyrån"]
[null,null,null,null,null,null,"ES/BFM - FMR"]
[null,null,null,null,null,null,"Box 24300"]
[null,null,null,null,null,null,"104 51 STOCKHOLM"]
[]
[]
[null,null,null,null,null,"Uppgifterna kommer att lämnas till "]
[null,null,null,null,null,"Sveriges riksbank."]

{"sheet":"Instructions","index":4,"n_rows":25,"n_cols":7,"rows_kept":25,"cut":false,"hidden":false,"merged":[]}
[]
[]
[]
[null,null,null,"Länkar till instruktioner",null,null,"Links to instructions"]
[]
[null,null,null,"Här nedan finner ni snabblänkar till olika avsnitt i instruktionerna på SCB:s",null,null,"Here below you will find quick-links to instructions on Statisctics Swedens website"]
[null,null,null,"uppgiftslämnarhemsida (http://www.scb.se/ruts). Internetuppkoppling krävs för att få",null,null,"(http://www.scb.se/ruts). Internet connection is required to access the instructions. Please click"]
[null,null,null,"tillgång till instruktionerna. Klicka på de blåfärgade länkarna nedan.",null,null," on the blue colored links below."]
[]
[null,null,null,"Generella instruktioner",null,null,"General instructions"]
[null,null,null,"Blanketten",null,null,"The reporting template"]
[null,null,null,"Mellanhavanden \"Vilka uppgifter ska rapporteras samt hantering av mellanhavanden\"",null,null,"Interoffice claims/liabilities \"Which items should be inlcuded and handling of interoffice business\""]
[]
[null,null,null,"Totala fordringar",null,null,"Total claims"]
[null,null,null,"Löptid",null,null,"Maturity"]
[]
[null,null,null,"Sektorfördelning",null,null,"Sectoral breakdown"]
[null,null,null,"MFI/bank\n",null,null,"MFI/banks"]
[null,null,null,"Offentlig sektor inklusive centralbanker och internationella organisationer",null,null,"General government including central banks and international organisations"]
[null,null,null,"Finansiella företag, ej MFI/Bank",null,null,"Non-bank financial institutions"]
[null,null,null,"Icke-finansiella företag",null,null,"Non-finansial corporations"]
[null,null,null,"Hushåll inklusive HIO",null,null,"Households including NPISH"]
[null,null,null,"Ofördelat",null,null,"Unallocated  sector"]
[]
[null,null,null,"Värdering",null,null,"Valuation"]

{"sheet":"Immidiate_borrower_basis","index":5,"n_rows":49,"n_cols":22,"rows_kept":49,"cut":false,"hidden":false,"merged":[[5,5,5,15],[5,19,5,20],[6,5,13,5],[6,6,7,9],[6,10,7,15],[6,19,13,19],[6,20,13,20],[8,6,13,6],[8,7,13,7],[8,8,13,8],[8,15,13,15],[14,2,14,3],[46,19,47,20],[8,9,13,9],[8,10,13,10],[8,11,13,11],[8,12,13,12],[8,13,13,13],[8,14,13,14]]}
[]
[]
[null,null,"Foreign-owned branches and subsidiaries in Sweden unconsolidated claims on the home country    (Utlandsägda filialer och döttrar i Sverige ej konsoliderade fordringar på hemlandet)"]
[]
[null,null,"Amounts in SEK, thousands (Belopp i tusental kronor)"]
[null,null,null,null,null,"Unconsolidated claims on the home country, incl. interoffice positions, in all currencies\n(Fordringar på hemlandet, inkl. mellanhavanden, i samtliga valutor)",null,null,null,null,null,null,null,null,null,null,null,null,null,"Consistency checks \n(Summeringskontroller)"]
[null,null,null,null,null,"Total","Maturities 4\n(Återstående löptid)",null,null,null,"Sectors\n(Sektorer)",null,null,null,null,null,null,null,null,"Check 4000\n=4030+4031\n+4032+4033","Check 4000\n=4035+4036\n+4041+4042\n+4043+4038"]
[]
[null,null,null,"Inside area countries",null,null,"Up to\none year\n<= 1 år","Over one year\nand less than\ntwo years\n> 1 år <= 2 år","Over two\nyears\n> 2 år","Unallocated\n(Ofördelade)","MFI/banks\n(MFI/bank)","Central banks and general government \n(Offentlig sektor inkl. centralbanker)","Non-bank financial institutions \n(Finansiella företag, ej MFI/Bank)","Non-financial corporations\n(Icke-finansiella företag)","Households including NPISH\n(Hushåll inkl. HIO)","Unallocated\n(Ofördelade)"]
[null,null,null,null,"ISO"]
[null,null,null,null,"CODE",null,null,null,null,null,null,null,"Non-bank financial insttutions \n(Andra finansiella institut än banker)"]
[null,null,null,null,null,null,null,null,null,null,null,null,null,"Non-financial corporations\n(Icke-finansiella företag)","Households including NPISH\n(Hushåll inkl. HIO)"]
[]
[]
[null,null,null,null,null,4000,4030,4031,4032,4033,4035,4036,4041,4042,4043,4038,null,null,null,"Chk 4000A","Chk 4000B"]
[null,null,null,"Australia","AU",{"$f":"SUM(G16:J16)","v":0},null,null,null,null,null,null,null,null,null,null,null,null,null,{"$f":"IF(ABS(F16-(SUM(G16:J16)))<=2,\"OK\",\"Error\")","v":"OK"},{"$f":"IF(ABS(F16-(SUM(K16:P16)))<=2,\"OK\",\"Error\")","v":"OK"}]
[null,null,null,"Austria","AT",{"$f":"SUM(G17:J17)","v":0},null,null,null,null,null,null,null,null,null,null,null,null,null,{"$f":"IF(ABS(F17-(SUM(G17:J17)))<=2,\"OK\",\"Error\")","v":"OK"},{"$f":"IF(ABS(F17-(SUM(K17:P17)))<=2,\"OK\",\"Error\")","v":"OK"}]
[null,null,null,"Belgium","BE",0,null,null,null,null,null,null,null,null,null,null,null,null,null,"OK","OK"]
[null,null,null,"Brazil","BR",0,null,null,null,null,null,null,null,null,null,null,null,null,null,"OK","OK"]
[null,null,null,"Canada","CA",0,null,null,null,null,null,null,null,null,null,null,null,null,null,"OK","OK"]
[null,null,null,"Chile","CL",0,null,null,null,null,null,null,null,null,null,null,null,null,null,"OK","OK"]
[null,null,null,"Denmark","DK",0,null,null,null,null,null,null,null,null,null,null,null,null,null,"OK","OK"]
[null,null,null,"Finland","FI",0,null,null,null,null,null,null,null,null,null,null,null,null,null,"OK","OK"]
[null,null,null,"France","FR",0,null,null,null,null,null,null,null,null,null,null,null,null,null,"OK","OK"]
[null,null,null,"Germany 1","DE",{"$f":"SUM(G25:J25)","v":0},null,null,null,null,null,null,null,null,null,null,null,null,null,"OK","OK"]
[null,null,null,"Greece","GR",0,null,null,null,null,null,null,null,null,null,null,null,null,null,"OK","OK"]
[null,null,null,"Hong Kong SAR","HK",0,null,null,null,null,null,null,null,null,null,null,null,null,null,"OK","OK"]
[null,null,null,"India","IN  ",0,null,null,null,null,null,null,null,null,null,null,null,null,null,"OK","OK"]
[null,null,null,"Ireland","IE",0,null,null,null,null,null,null,null,null,null,null,null,null,null,"OK","OK"]
[null,null,null,"Italy","IT",{"$f":"SUM(G30:J30)","v":0},null,null,null,null,null,null,null,null,null,null,null,null,null,"OK","OK"]
{"$rows_left_out":20}
{"sheet":"Country_Information","index":6,"n_rows":221,"n_cols":4,"rows_kept":221,"cut":false,"hidden":false,"merged":[]}
[]
[null,"Countries in alphabetic order","ISO\nCode","Comments to what is included, excluded, etc."]
[null,"Afghanistan","AF"]
[null,"Albania","AL"]
[null,"Algeria ","DZ"]
[null,"Andorra","AD"]
[null,"Angola","AO"]
[null,"Argentina","AR "]
[null,"Armenia","AM","As from 1993 Q4"]
[null,"Aruba","AW"]
[null,"Australia","AU","Including Christmas Islands, Cocos Islands, Norfolk Islands, Heard and McDonald Islands, Territory of Ashmore and Cartier Islands and Territory of Coral Sea Islands"]
[null,"Austria","AT"]
[null,"Azerbaijan","AZ","As from 1993 Q4"]
[null,"Bahamas","BS"]
[null,"Bahrain","BH"]
[null,"Bangladesh","BD"]
[null,"Barbados","BB"]
[null,"Belarus","BY","As from 1993 Q4"]
[null,"Belgium","BE"]
[null,"Belize","BZ "]
[null,"Benin","BJ"]
[null,"Bermuda","BM"]
[null,"Bhutan","BT"]
[null,"Bolivia","BO"]
[null,"Bonaire, Sint Eustatius and Saba","BQ","As from 2010 Q4"]
[null,"Bosnia and Herzegovina","BA  ","As from 1993 Q4 "]
[null,"Botswana","BW"]
[null,"Brazil","BR"]
[null,"British Overseas Territories","1W *","Including British Antarctic Territory, British Indian Ocean Territory, Chagos, Pitcairn Islands, South Georgia and South Sandwich Islands"]
[null,"Brunei  ","BN  "]
{"$rows_left_out":192}
{"sheet":"Summary","index":7,"n_rows":332,"n_cols":13,"rows_kept":332,"cut":false,"hidden":false,"merged":[]}
[null,null,"Var.Värde","Variabelkod","Spec","Kolumn","Rad","Kontoslag","Löptid","Säkrehet","Land","Motpart","Valuta"]
["Start","$G$19",{"$f":"IF(ISBLANK(INDIRECT(CONCATENATE(\"'\",A2,\"'\",\"!\",B2))),\"\",(INDIRECT(CONCATENATE(\"'\",A2,\"'\",\"!\",B2))))","v":""},"7_X_X_X_X_X_X_X_X_X_T3","Start","G",19,"Ej specificerat","Ej specificerad","Ej specificerad","Ospecificerat","Ej specificerad","Ospecificerat"]
["Immidiate_borrower_basis","$F$16",0,"5_A_EF_X_X_X_AU_N_V_B_A","Immidiate_borrower_basis","F",16,"Tillgång","Ej specificerad","Ej specificerad","Australia","(S1) Nationell ekonomi, totalt","V"]
["Immidiate_borrower_basis","$G$16","","5_A_EF_LR_X_X_AU_N_V_B_A","Immidiate_borrower_basis","G",16,"Tillgång","Ej specificerad","Återstående löptid <= 1 år","Australia","(S1) Nationell ekonomi, totalt","V"]
["Immidiate_borrower_basis","$H$16","","5_A_EF_LS_X_X_AU_N_V_B_A","Immidiate_borrower_basis","H",16,"Tillgång","Ej specificerad","Återstående löptid > 1 år <= 2 år","Australia","(S1) Nationell ekonomi, totalt","V"]
["Immidiate_borrower_basis","$I$16","","5_A_EF_LY_X_X_AU_N_V_B_A","Immidiate_borrower_basis","I",16,"Tillgång","Ej specificerad","Återstående löptid > 2 år","Australia","(S1) Nationell ekonomi, totalt","V"]
["Immidiate_borrower_basis","$J$16","","5_A_EF_LZ_X_X_AU_N_V_B_A","Immidiate_borrower_basis","J",16,"Tillgång","Ej specificerad","Ej fördelad på återstående löptid","Australia","(S1) Nationell ekonomi, totalt","V"]
["Immidiate_borrower_basis","$K$16","","5_A_EF_X_X_X_AU_N12111_V_B_A","Immidiate_borrower_basis","K",16,"Tillgång","Ej specificerad","Ej specificerad","Australia","Banker inklusive centralbanker","V"]
["Immidiate_borrower_basis","$L$16","","5_A_EF_X_X_X_AU_NXU_V_B_A","Immidiate_borrower_basis","L",16,"Tillgång","Ej specificerad","Ej specificerad","Australia","Off sektor + off ägda ftg utom banker","V"]
["Immidiate_borrower_basis","$M$16","","5_A_EF_X_X_X_AU_N122_V_B_A","Immidiate_borrower_basis","M",16,"Tillgång","Ej specificerad","Ej specificerad","Australia","Icke-monetära finansinstitut","V"]
["Immidiate_borrower_basis","$N$16","","5_A_EF_X_X_X_AU_N11_V_B_A","Immidiate_borrower_basis","N",16,"Tillgång","Ej specificerad","Ej specificerad","Australia","1 (S11)  Icke-finansiella företag","V"]
["Immidiate_borrower_basis","$O$16","","5_A_EF_X_X_X_AU_N3_V_B_A","Immidiate_borrower_basis","O",16,"Tillgång","Ej specificerad","Ej specificerad","Australia","Hushåll + Hushållens icke-vinstdrivande","V"]
["Immidiate_borrower_basis","$P$16","","5_A_EF_X_X_X_AU_N9_V_B_A","Immidiate_borrower_basis","P",16,"Tillgång","Ej specificerad","Ej specificerad","Australia","Ej motpartsfördelat","V"]
["Immidiate_borrower_basis","$F$17",0,"5_A_EF_X_X_X_AT_N_V_B_A","Immidiate_borrower_basis","F",17,"Tillgång","Ej specificerad","Ej specificerad","Austria","(S1) Nationell ekonomi, totalt","V"]
["Immidiate_borrower_basis","$G$17","","5_A_EF_LR_X_X_AT_N_V_B_A","Immidiate_borrower_basis","G",17,"Tillgång","Ej specificerad","Återstående löptid <= 1 år","Austria","(S1) Nationell ekonomi, totalt","V"]
["Immidiate_borrower_basis","$H$17","","5_A_EF_LS_X_X_AT_N_V_B_A","Immidiate_borrower_basis","H",17,"Tillgång","Ej specificerad","Återstående löptid > 1 år <= 2 år","Austria","(S1) Nationell ekonomi, totalt","V"]
["Immidiate_borrower_basis","$I$17","","5_A_EF_LY_X_X_AT_N_V_B_A","Immidiate_borrower_basis","I",17,"Tillgång","Ej specificerad","Återstående löptid > 2 år","Austria","(S1) Nationell ekonomi, totalt","V"]
["Immidiate_borrower_basis","$J$17","","5_A_EF_LZ_X_X_AT_N_V_B_A","Immidiate_borrower_basis","J",17,"Tillgång","Ej specificerad","Ej fördelad på återstående löptid","Austria","(S1) Nationell ekonomi, totalt","V"]
["Immidiate_borrower_basis","$K$17","","5_A_EF_X_X_X_AT_N12111_V_B_A","Immidiate_borrower_basis","K",17,"Tillgång","Ej specificerad","Ej specificerad","Austria","Banker inklusive centralbanker","V"]
["Immidiate_borrower_basis","$L$17","","5_A_EF_X_X_X_AT_NXU_V_B_A","Immidiate_borrower_basis","L",17,"Tillgång","Ej specificerad","Ej specificerad","Austria","Off sektor + off ägda ftg utom banker","V"]
["Immidiate_borrower_basis","$M$17","","5_A_EF_X_X_X_AT_N122_V_B_A","Immidiate_borrower_basis","M",17,"Tillgång","Ej specificerad","Ej specificerad","Austria","Icke-monetära finansinstitut","V"]
["Immidiate_borrower_basis","$N$17","","5_A_EF_X_X_X_AT_N11_V_B_A","Immidiate_borrower_basis","N",17,"Tillgång","Ej specificerad","Ej specificerad","Austria","1 (S11)  Icke-finansiella företag","V"]
["Immidiate_borrower_basis","$O$17","","5_A_EF_X_X_X_AT_N3_V_B_A","Immidiate_borrower_basis","O",17,"Tillgång","Ej specificerad","Ej specificerad","Austria","Hushåll + Hushållens icke-vinstdrivande","V"]
["Immidiate_borrower_basis","$P$17","","5_A_EF_X_X_X_AT_N9_V_B_A","Immidiate_borrower_basis","P",17,"Tillgång","Ej specificerad","Ej specificerad","Austria","Ej motpartsfördelat","V"]
["Immidiate_borrower_basis","$F$18",0,"5_A_EF_X_X_X_BE_N_V_B_A","Immidiate_borrower_basis","F",18,"Tillgång","Ej specificerad","Ej specificerad","Belgium","(S1) Nationell ekonomi, totalt","V"]
["Immidiate_borrower_basis","$G$18","","5_A_EF_LR_X_X_BE_N_V_B_A","Immidiate_borrower_basis","G",18,"Tillgång","Ej specificerad","Återstående löptid <= 1 år","Belgium","(S1) Nationell ekonomi, totalt","V"]
["Immidiate_borrower_basis","$H$18","","5_A_EF_LS_X_X_BE_N_V_B_A","Immidiate_borrower_basis","H",18,"Tillgång","Ej specificerad","Återstående löptid > 1 år <= 2 år","Belgium","(S1) Nationell ekonomi, totalt","V"]
["Immidiate_borrower_basis","$I$18","","5_A_EF_LY_X_X_BE_N_V_B_A","Immidiate_borrower_basis","I",18,"Tillgång","Ej specificerad","Återstående löptid > 2 år","Belgium","(S1) Nationell ekonomi, totalt","V"]
["Immidiate_borrower_basis","$J$18","","5_A_EF_LZ_X_X_BE_N_V_B_A","Immidiate_borrower_basis","J",18,"Tillgång","Ej specificerad","Ej fördelad på återstående löptid","Belgium","(S1) Nationell ekonomi, totalt","V"]
["Immidiate_borrower_basis","$K$18","","5_A_EF_X_X_X_BE_N12111_V_B_A","Immidiate_borrower_basis","K",18,"Tillgång","Ej specificerad","Ej specificerad","Belgium","Banker inklusive centralbanker","V"]
{"$rows_left_out":302}